Search found 1 match

by Zemog Zurc
Wed Jul 23, 2014 5:09 pm
Forum: bug reports
Topic: error compilation
Replies: 3
Views: 4263

Re: error compilation

Hello Lubin I´ve experienced the same problem but in different way because I try to compile a blinking led project using the dsPIC30F4011 but when I compile it an error appears. My error is: Blinking_led_main.c:32: error: 'BORV_20' undeclared here (not in a function) gmake: *** [Blinking_led_main.o]...