Error(s) encountered while building model "ADC6"

nammta
Posts: 3
Joined: Mon Mar 05, 2012 9:39 am

Error(s) encountered while building model "ADC6"

Postby nammta » Mon Mar 05, 2012 10:47 am

Hello,

This is my first attempt to get started with the block set.

I'm running Matlab R2010.a 32bit and installed the C30 compiler as well as the blockset. That worked out fine.

Code: Select all

### Real-Time Workshop build procedure for model: 'CAN_a_30f4012' aborted due to an error.
***** Solver Mode change from Auto to SingleTasking (this mode allows single rate and multirate). See help to get the difference with the MultiTasking mode which is now supported by the blockset *****
new GMAKE path : E:\MATLAB\bin\win32\gmake
file not found : C:\PROGRA~2\MICROC~1\mplabc30\v3.25\support\dsPIC30F\gld\p30f3012.gld
      --> corrected : find in --script=C:\PROGRA~1\MICROC~1\mplabc30\v3.30\support\dsPIC30F\gld\p30f3012.gld
file not found : C:\PROGRA~2\MICROC~1\mplabc30\v3.25\lib\libpic30-coff.a
      --> corrected : find in C:\PROGRA~1\MICROC~1\mplabc30\v3.30\lib\libpic30-coff.a
file not found : C:\PROGRA~2\MICROC~1\mplabc30\v3.25\lib\dsPIC30F\libp30f3012-coff.a
      --> corrected : find in C:\PROGRA~1\MICROC~1\mplabc30\v3.30\lib\dsPIC30F\libp30f3012-coff.a
file not found : C:\PROGRA~2\MICROC~1\mplabc30\v3.25\lib\libc-coff.a
      --> corrected : find in C:\PROGRA~1\MICROC~1\mplabc30\v3.30\lib\libc-coff.a
file not found : C:\PROGRA~2\MICROC~1\mplabc30\v3.25\lib\libm-coff.a
      --> corrected : find in C:\PROGRA~1\MICROC~1\mplabc30\v3.30\lib\libm-coff.a
directory not found : C:\Program Files\Microchip\mplabc30\v3.30\include
      --> corrected : find in C:\PROGRA~1\MICROC~1\mplabc30\v3.30\include
PTModel configured...
Target definition is different from that in the model. Updating target according to the new definition.  The following parameters were updated:
   ModelReferenceCompliant
### Starting Real-Time Workshop build procedure for model: Servo_ADC
### Generating code into build directory: C:\Documents and Settings\minhnam\Desktop\install_dsPIC_R2010a\Servo_ADC_dspic\sources
PTPTPNumber of I/O PINs used : 2
TPTTPTPNumber of I/O PINs used : 2
TTTTTPTPNumber of I/O PINs used : 2
TPNumber of I/O PINs used : 2
TTPTPTTTPTPNumber of I/O PINs used : 2
TPNumber of I/O PINs used : 2
TTPTPTTTPNumber of I/O PINs used : 2
TPNumber of I/O PINs used : 2
TPNumber of I/O PINs used : 2
TTPTPTTWarning: Source 'Servo_ADC/ADC Input' specifies that its sample time (-1) is back-inherited. You should explicitly specify the
sample time of sources. You can disable this diagnostic by setting the 'Source block specifies -1 sample time' diagnostic to
'none' in the Sample Time group on the Diagnostics pane of the Configuration Parameters dialog box.
Warning: Parameter precision loss occurred for 'Value'. The parameter's value cannot be represented exactly using the run-time
data type. A small quantization error has occurred. You can control this diagnostic on the Diagnostics pane of the
Configuration Parameters dialog. This originated from 'Servo_ADC/Constant1'.
Warning: Parameter precision loss occurred for 'Gain'. The parameter's value cannot be represented exactly using the run-time
data type. A small quantization error has occurred. You can control this diagnostic on the Diagnostics pane of the
Configuration Parameters dialog. This originated from 'Servo_ADC/Gain'.
### Invoking Target Language Compiler on Servo_ADC.rtw
### Using System Target File: C:\Documents and Settings\minhnam\Desktop\install_dsPIC_R2010a\dspic\dspic.tlc
### Loading TLC function libraries
.....
### Initial pass through model to cache user defined code
..
### Caching model source code
.................
### Writing main
--- Multi Rate & Single Tasking implementation
.
### Writing header file Servo_ADC.h
### Writing header file Servo_ADC_types.h
.
### Writing header file rtwtypes.h
### Writing source file Servo_ADC.c
### Writing header file Servo_ADC_private.h
.
### Writing source file Servo_ADC_data.c
### Writing header file autobuild.h
.
### Writing source file Servo_ADC_main.c
### TLC code generation complete.
### Evaluating PostCodeGenCommand specified in the model

     ----------------------------------------------------
     ----------------------------------------------------
Embedded Coder for dsPIC V3.7c(09-Jan-2012) for Matlab R2010a.


Licence Accorded to  Demonstration Version
                     RTWdsPIC@kerhuel.eu
                     Author : Lubin KERHUEL
                     WEBSITE : http://www.kerhuel.eu/wiki
                     
                     SIRENE : 503 920 456
                     SIRET : 503 920 456 00012

 Facturation to :    Demo
                     Demo
                     Lubin KERHUEL
                     1, rue Alfred Fredet
                     38100 Grenoble
                     FRANCE

     ----------------------------------------------------
Check updates and new informations at :  http://www.kerhuel.eu
     ----------------------------------------------------

.
### Processing Template Makefile: C:\Documents and Settings\minhnam\Desktop\install_dsPIC_R2010a\dspic\dspic_pic30_gcc.tmf
-- Bypassing matlab internal LCC configuration --
### Servo_ADC.mk which is generated from C:\Documents and Settings\minhnam\Desktop\install_dsPIC_R2010a\dspic\dspic_pic30_gcc.tmf is up to date
### Building Servo_ADC: "E:\MATLAB\bin\win32\gmake" -f Servo_ADC.mk  GENERATE_REPORT=0 MULTI_INSTANCE_CODE=0 PORTABLE_WORDSIZES=0 GENERATE_ASAP2=0 TMW_EXTMODE_TESTING=0
''pic30-gcc  -c -mcpu=30f3012 -O3 -fschedule-insns -fschedule-insns2    -O   -I. -I..\.. -IE:\MATLAB/simulink/include -IE:\MATLAB/extern/include -IE:\MATLAB/rtw/c/src -IE:\MATLAB/rtw/c/ert -IE:\MATLAB/rtw/c/src/ext_mode/common -IC:\DOCUME~1\minhnam\Desktop\INSTAL~2\Servo_ADC_dspic\sources -IC:\DOCUME~1\minhnam\Desktop\INSTAL~2 -IC:\DOCUME~1\minhnam\Desktop\INSTAL~2\examples   -I C:\PROGRA~1\MICROC~1\mplabc30\v3.30\include    Servo_ADC_data.c
''pic30-gcc  -c -mcpu=30f3012 -O3 -fschedule-insns -fschedule-insns2    -O   -I. -I..\.. -IE:\MATLAB/simulink/include -IE:\MATLAB/extern/include -IE:\MATLAB/rtw/c/src -IE:\MATLAB/rtw/c/ert -IE:\MATLAB/rtw/c/src/ext_mode/common -IC:\DOCUME~1\minhnam\Desktop\INSTAL~2\Servo_ADC_dspic\sources -IC:\DOCUME~1\minhnam\Desktop\INSTAL~2 -IC:\DOCUME~1\minhnam\Desktop\INSTAL~2\examples   -I C:\PROGRA~1\MICROC~1\mplabc30\v3.30\include    Servo_ADC_main.c
Servo_ADC_main.c:34: error: syntax error before numeric constant
Servo_ADC_main.c: In function '_FICD':
Servo_ADC_main.c:36: error: syntax error before '{' token
gmake: *** [Servo_ADC_main.o] Error 255
### Real-Time Workshop build procedure for model: 'Servo_ADC' aborted due to an error.

LubinKerhuel
Site Admin - Expert
Posts: 616
Joined: Wed Mar 07, 2007 11:23 pm
Location: Marseille - France
Contact:

Re: Error(s) encountered while building model "ADC6"

Postby LubinKerhuel » Mon Mar 05, 2012 11:01 am

The _FICD register were renamed to _ICD is some compilers version (3.25, 3.30).

Latest compiler version set this register name to _FICD.
Please download latest C30 compiler (3.31) and perhaps remove others compilers version to make sure the blockset will choose automatically the latest one.

Lubin

nammta
Posts: 3
Joined: Mon Mar 05, 2012 9:39 am

Re: Error(s) encountered while building model "ADC6"

Postby nammta » Mon Mar 05, 2012 4:57 pm

Thanks for the fast answer!!
:D :D :D

nammta
Posts: 3
Joined: Mon Mar 05, 2012 9:39 am

Re: Error(s) encountered while building model "ADC6"

Postby nammta » Thu Mar 29, 2012 5:09 pm

how fix this ?
Error: File: C:\Documents and Settings\minhnam\Desktop\Vidu\USB6_dspic\sources\tlc\dsPIC_main.tlc Line: 27 Column: 12
Attempt to call a non-function value: FcnMultiTaskingMain
Error: File: C:\Documents and Settings\minhnam\Desktop\Vidu\USB6_dspic\sources\tlc\dsPIC_main.tlc Line: 27 Column: 31
Values of NULL type cannot be expanded


Return to “Requirement, Installation & Configuration”

Who is online

Users browsing this forum: No registered users and 1 guest